__THROW problem while compiling pegasus on MacOSX

Asif sayyad.asif at spsoftindia.com
Wed Oct 8 09:08:47 PDT 2003


Hi all,

I am compliling Open pegasus on MacOsx but i am faccing following problems.

i have gone thru many mailing lists and this __THROW problem has been arrived to many of developers but i havent 

got a proper solution 

Here is the output file of errors when i complied pegasus on macosx.

g++ -c -o SOLARIS_SPARC_GNU.o -O2 -W -Wall -Wno-unused -fpic -DPEGASUS_COMMON_INTERNAL -DPEGASUS_INTERNALONLY -DPEGASUS_MEMORY_DEBUG -DPEGASUS_PLATFORM_SOLARIS_SPARC_GNU -I/Users/johnsy/Pegasus/pegasus-2.2.1/src System.cpp

cc1plus: warning: -fpic is not supported; -fPIC assumed

In file included from SystemUnix.cpp:45,

from System.cpp:49:

/usr/include/dlfcn.h: In function `void* dlopen(const char*, int)':

/usr/include/dlfcn.h:47: parse error before `;' token

/usr/include/dlfcn.h: In function `int dlclose(void*)':

/usr/include/dlfcn.h:51: parse error before `;' token

/usr/include/dlfcn.h:51: redefinition of `int __THROW'

/usr/include/dlfcn.h:47: `int __THROW' previously declared here

/usr/include/dlfcn.h: In function `void* dlsym(void*, const char*)':

/usr/include/dlfcn.h:56: parse error before `;' token

/usr/include/dlfcn.h:56: redefinition of `int __THROW'

/usr/include/dlfcn.h:51: `int __THROW' previously declared here

/usr/include/dlfcn.h: In function `char* dlerror()':

/usr/include/dlfcn.h:69: parse error before `;' token

/usr/include/dlfcn.h:69: redefinition of `int __THROW'

/usr/include/dlfcn.h:56: `int __THROW' previously declared here

In file included from SystemUnix.cpp:53,

from System.cpp:49:

/usr/include/crypt.h: In function `char* crypt(const char*, const char*)':

/usr/include/crypt.h:33: parse error before `;' token

/usr/include/crypt.h:33: redefinition of `int __THROW'

/usr/include/dlfcn.h:69: `int __THROW' previously declared here

/usr/include/crypt.h: In function `void setkey(const char*)':

/usr/include/crypt.h:36: declaration of C function `void setkey(const char*)' 

conflicts with

/usr/include/unistd.h:210: previous declaration `int setkey(const char*)' here

/usr/include/crypt.h: In function `void setkey(const char*)':

/usr/include/crypt.h:36: parse error before `;' token

/usr/include/crypt.h:36: redefinition of `int __THROW'

/usr/include/crypt.h:33: `int __THROW' previously declared here

/usr/include/crypt.h: In function `void encrypt(char*, int)':

/usr/include/crypt.h:40: declaration of C function `void encrypt(char*, int)' 

conflicts with

/usr/include/unistd.h:155: previous declaration `int encrypt(char*, int)' here

/usr/include/crypt.h: In function `void encrypt(char*, int)':

/usr/include/crypt.h:40: parse error before `;' token

/usr/include/crypt.h:40: redefinition of `int __THROW'

/usr/include/crypt.h:36: `int __THROW' previously declared here

In file included from /Users/johnsy/Pegasus/pegasus-2.2.1/src/Pegasus/Common/Exception.h:42,

from /Users/johnsy/Pegasus/pegasus-2.2.1/src/Pegasus/Common/InternalException.h:35,

from /Users/johnsy/Pegasus/pegasus-2.2.1/src/Pegasus/Common/Tracer.h:38,

from SystemUnix.cpp:67,

from System.cpp:49:

/Users/johnsy/Pegasus/pegasus-2.2.1/src/Pegasus/Common/CIMStatusCode.h:116: `

CIMStatusCode' undeclared (first use this function)

/Users/johnsy/Pegasus/pegasus-2.2.1/src/Pegasus/Common/CIMStatusCode.h:116: (Each

undeclared identifier is reported only once for each function it appears 

in.)

/Users/johnsy/Pegasus/pegasus-2.2.1/src/Pegasus/Common/CIMStatusCode.h:116: parse

error before `)' token

In file included from /Users/johnsy/Pegasus/pegasus-2.2.1/src/Pegasus/Common/InternalException.h:35,

from /Users/johnsy/Pegasus/pegasus-2.2.1/src/Pegasus/Common/Tracer.h:38,

from SystemUnix.cpp:67,

from System.cpp:49:

/Users/johnsy/Pegasus/pegasus-2.2.1/src/Pegasus/Common/Exception.h:62: parse 

error before `&' token

/Users/johnsy/Pegasus/pegasus-2.2.1/src/Pegasus/Common/Exception.h:71: warning: ISO

C++ forbids declaration of `String' with no type

/Users/johnsy/Pegasus/pegasus-2.2.1/src/Pegasus/Common/Exception.h:71: `String' 

declared as a `virtual' field

/Users/johnsy/Pegasus/pegasus-2.2.1/src/Pegasus/Common/Exception.h:71: parse 

error before `&' token

/Users/johnsy/Pegasus/pegasus-2.2.1/src/Pegasus/Common/Exception.h:77: syntax 

error before `*' token

/Users/johnsy/Pegasus/pegasus-2.2.1/src/Pegasus/Common/Exception.h:83: parse 

error before `{' token

/Users/johnsy/Pegasus/pegasus-2.2.1/src/Pegasus/Common/Exception.h:91: parse 

error before `{' token

/Users/johnsy/Pegasus/pegasus-2.2.1/src/Pegasus/Common/Exception.h:99: parse 

error before `{' token

/Users/johnsy/Pegasus/pegasus-2.2.1/src/Pegasus/Common/Exception.h:107: parse 

error before `{' token

/Users/johnsy/Pegasus/pegasus-2.2.1/src/Pegasus/Common/Exception.h:115: parse 

error before `{' token

/Users/johnsy/Pegasus/pegasus-2.2.1/src/Pegasus/Common/Exception.h:123: parse 

error before `{' token

/Users/johnsy/Pegasus/pegasus-2.2.1/src/Pegasus/Common/Exception.h:135: parse 

error before `{' token

/Users/johnsy/Pegasus/pegasus-2.2.1/src/Pegasus/Common/Exception.h:143: parse 

error before `{' token

/Users/johnsy/Pegasus/pegasus-2.2.1/src/Pegasus/Common/Exception.h:151: parse 

error before `{' token

/Users/johnsy/Pegasus/pegasus-2.2.1/src/Pegasus/Common/Exception.h:159: parse 

error before `{' token

/Users/johnsy/Pegasus/pegasus-2.2.1/src/Pegasus/Common/Exception.h:167: parse 

error before `{' token

/Users/johnsy/Pegasus/pegasus-2.2.1/src/Pegasus/Common/Exception.h:175: parse 

error before `{' token

/Users/johnsy/Pegasus/pegasus-2.2.1/src/Pegasus/Common/Exception.h:183: parse 

error before `{' token

/Users/johnsy/Pegasus/pegasus-2.2.1/src/Pegasus/Common/Exception.h:191: parse 

error before `{' token

/Users/johnsy/Pegasus/pegasus-2.2.1/src/Pegasus/Common/Exception.h:199: parse 

error before `{' token

/Users/johnsy/Pegasus/pegasus-2.2.1/src/Pegasus/Common/Exception.h:207: parse 

error before `{' token

/Users/johnsy/Pegasus/pegasus-2.2.1/src/Pegasus/Common/Exception.h:215: parse 

error before `{' token

/Users/johnsy/Pegasus/pegasus-2.2.1/src/Pegasus/Common/Exception.h:223: parse 

error before `{' token

/Users/johnsy/Pegasus/pegasus-2.2.1/src/Pegasus/Common/Exception.h:233: parse 

error before `{' token

/Users/johnsy/Pegasus/pegasus-2.2.1/src/Pegasus/Common/Exception.h:242: parse 

error before `const'

/Users/johnsy/Pegasus/pegasus-2.2.1/src/Pegasus/Common/Exception.h:245: warning: non-local

function `encrypt(char*, int)::CIMException& operator=(const encrypt(char*, 

int)::CIMException&)' uses local type `encrypt(char*, int)::CIMException'

/Users/johnsy/Pegasus/pegasus-2.2.1/src/Pegasus/Common/Exception.h:245: `

encrypt(char*, int)::CIMException& operator=(const encrypt(char*, 

int)::CIMException&)' must be a nonstatic member function

/Users/johnsy/Pegasus/pegasus-2.2.1/src/Pegasus/Common/Exception.h:245: `

encrypt(char*, int)::CIMException& operator=(const encrypt(char*, 

int)::CIMException&)' must take exactly two arguments

/Users/johnsy/Pegasus/pegasus-2.2.1/src/Pegasus/Common/Exception.h:248: destructors

must be member functions

/Users/johnsy/Pegasus/pegasus-2.2.1/src/Pegasus/Common/Exception.h:248: virtual 

outside class declaration

/Users/johnsy/Pegasus/pegasus-2.2.1/src/Pegasus/Common/Exception.h:251: parse 

error before `)' token

In file included from /Users/johnsy/Pegasus/pegasus-2.2.1/src/Pegasus/Common/Tracer.h:38,

from SystemUnix.cpp:67,

from System.cpp:49:

/Users/johnsy/Pegasus/pegasus-2.2.1/src/Pegasus/Common/InternalException.h:45: parse

error before `{' token

/Users/johnsy/Pegasus/pegasus-2.2.1/src/Pegasus/Common/InternalException.h:98: parse

error before `{' token

/Users/johnsy/Pegasus/pegasus-2.2.1/src/Pegasus/Common/InternalException.h:108: parse

error before `{' token

/Users/johnsy/Pegasus/pegasus-2.2.1/src/Pegasus/Common/InternalException.h:113: parse

error before `const'

/Users/johnsy/Pegasus/pegasus-2.2.1/src/Pegasus/Common/InternalException.h:119: parse

error before `{' token

/Users/johnsy/Pegasus/pegasus-2.2.1/src/Pegasus/Common/InternalException.h:124: parse

error before `const'

/Users/johnsy/Pegasus/pegasus-2.2.1/src/Pegasus/Common/InternalException.h:130: parse

error before `{' token

/Users/johnsy/Pegasus/pegasus-2.2.1/src/Pegasus/Common/InternalException.h:135: parse

error before `const'

/Users/johnsy/Pegasus/pegasus-2.2.1/src/Pegasus/Common/InternalException.h:140: parse

error before `{' token

/Users/johnsy/Pegasus/pegasus-2.2.1/src/Pegasus/Common/InternalException.h:145: parse

error before `const'

/Users/johnsy/Pegasus/pegasus-2.2.1/src/Pegasus/Common/InternalException.h:151: parse

error before `{' token

/Users/johnsy/Pegasus/pegasus-2.2.1/src/Pegasus/Common/InternalException.h:156: parse

error before `const'

/Users/johnsy/Pegasus/pegasus-2.2.1/src/Pegasus/Common/InternalException.h:162: parse

error before `{' token

/Users/johnsy/Pegasus/pegasus-2.2.1/src/Pegasus/Common/InternalException.h:167: parse

error before `const'

/Users/johnsy/Pegasus/pegasus-2.2.1/src/Pegasus/Common/InternalException.h:173: parse

error before `{' token

/Users/johnsy/Pegasus/pegasus-2.2.1/src/Pegasus/Common/InternalException.h:184: parse

error before `{' token

/Users/johnsy/Pegasus/pegasus-2.2.1/src/Pegasus/Common/InternalException.h:189: parse

error before `const'

/Users/johnsy/Pegasus/pegasus-2.2.1/src/Pegasus/Common/InternalException.h:195: parse

error before `{' token

/Users/johnsy/Pegasus/pegasus-2.2.1/src/Pegasus/Common/InternalException.h:200: parse

error before `const'

/Users/johnsy/Pegasus/pegasus-2.2.1/src/Pegasus/Common/InternalException.h:206: parse

error before `{' token

/Users/johnsy/Pegasus/pegasus-2.2.1/src/Pegasus/Common/InternalException.h:211: parse

error before `const'

/Users/johnsy/Pegasus/pegasus-2.2.1/src/Pegasus/Common/InternalException.h:216: parse

error before `{' token

/Users/johnsy/Pegasus/pegasus-2.2.1/src/Pegasus/Common/InternalException.h:221: parse

error before `const'

/Users/johnsy/Pegasus/pegasus-2.2.1/src/Pegasus/Common/InternalException.h:226: parse

error before `{' token

/Users/johnsy/Pegasus/pegasus-2.2.1/src/Pegasus/Common/InternalException.h:231: parse

error before `const'

/Users/johnsy/Pegasus/pegasus-2.2.1/src/Pegasus/Common/InternalException.h:236: parse

error before `{' token

/Users/johnsy/Pegasus/pegasus-2.2.1/src/Pegasus/Common/InternalException.h:241: parse

error before `const'

/Users/johnsy/Pegasus/pegasus-2.2.1/src/Pegasus/Common/InternalException.h:246: parse

error before `{' token

/Users/johnsy/Pegasus/pegasus-2.2.1/src/Pegasus/Common/InternalException.h:251: parse

error before `const'

/Users/johnsy/Pegasus/pegasus-2.2.1/src/Pegasus/Common/InternalException.h:256: parse

error before `{' token

/Users/johnsy/Pegasus/pegasus-2.2.1/src/Pegasus/Common/InternalException.h:261: parse

error before `const'

/Users/johnsy/Pegasus/pegasus-2.2.1/src/Pegasus/Common/InternalException.h:267: parse

error before `{' token

/Users/johnsy/Pegasus/pegasus-2.2.1/src/Pegasus/Common/InternalException.h:272: parse

error before `const'

/Users/johnsy/Pegasus/pegasus-2.2.1/src/Pegasus/Common/InternalException.h:278: parse

error before `{' token

/Users/johnsy/Pegasus/pegasus-2.2.1/src/Pegasus/Common/InternalException.h:283: parse

error before `const'

/Users/johnsy/Pegasus/pegasus-2.2.1/src/Pegasus/Common/InternalException.h:289: parse

error before `{' token

/Users/johnsy/Pegasus/pegasus-2.2.1/src/Pegasus/Common/InternalException.h:294: parse

error before `const'

/Users/johnsy/Pegasus/pegasus-2.2.1/src/Pegasus/Common/InternalException.h:298: parse

error before `{' token

/Users/johnsy/Pegasus/pegasus-2.2.1/src/Pegasus/Common/InternalException.h:307: parse

error before `{' token

/Users/johnsy/Pegasus/pegasus-2.2.1/src/Pegasus/Common/InternalException.h:316: parse

error before `{' token

/Users/johnsy/Pegasus/pegasus-2.2.1/src/Pegasus/Common/InternalException.h:325: parse

error before `{' token

/Users/johnsy/Pegasus/pegasus-2.2.1/src/Pegasus/Common/InternalException.h:334: parse

error before `{' token

/Users/johnsy/Pegasus/pegasus-2.2.1/src/Pegasus/Common/InternalException.h:343: parse

error before `{' token

/Users/johnsy/Pegasus/pegasus-2.2.1/src/Pegasus/Common/InternalException.h:348: parse

error before `const'

/Users/johnsy/Pegasus/pegasus-2.2.1/src/Pegasus/Common/InternalException.h:353: parse

error before `{' token

/Users/johnsy/Pegasus/pegasus-2.2.1/src/Pegasus/Common/InternalException.h:358: parse

error before `const'

/Users/johnsy/Pegasus/pegasus-2.2.1/src/Pegasus/Common/InternalException.h:363: parse

error before `{' token

/Users/johnsy/Pegasus/pegasus-2.2.1/src/Pegasus/Common/InternalException.h:368: parse

error before `const'

/Users/johnsy/Pegasus/pegasus-2.2.1/src/Pegasus/Common/InternalException.h:372: parse

error before `{' token

/Users/johnsy/Pegasus/pegasus-2.2.1/src/Pegasus/Common/InternalException.h:377: parse

error before `const'

/Users/johnsy/Pegasus/pegasus-2.2.1/src/Pegasus/Common/InternalException.h:381: parse

error before `{' token

/Users/johnsy/Pegasus/pegasus-2.2.1/src/Pegasus/Common/InternalException.h:390: parse

error before `{' token

/Users/johnsy/Pegasus/pegasus-2.2.1/src/Pegasus/Common/InternalException.h:399: parse

error before `{' token

/Users/johnsy/Pegasus/pegasus-2.2.1/src/Pegasus/Common/InternalException.h:408: parse

error before `{' token

/Users/johnsy/Pegasus/pegasus-2.2.1/src/Pegasus/Common/InternalException.h:419: base

class `encrypt(char*, int)::CIMException' has incomplete type

/Users/johnsy/Pegasus/pegasus-2.2.1/src/Pegasus/Common/InternalException.h:423: parse

error before `code'

/Users/johnsy/Pegasus/pegasus-2.2.1/src/Pegasus/Common/InternalException.h:428: parse

error before `&' token

/Users/johnsy/Pegasus/pegasus-2.2.1/src/Pegasus/Common/InternalException.h:430: parse

error before `)' token

/Users/johnsy/Pegasus/pegasus-2.2.1/src/Pegasus/Common/InternalException.h:432: parse

error before `)' token

/Users/johnsy/Pegasus/pegasus-2.2.1/src/Pegasus/Common/InternalException.h:438: parse

error before `}' token

In file included from /Users/johnsy/Pegasus/pegasus-2.2.1/src/Pegasus/Common/Tracer.h:40,

from SystemUnix.cpp:67,

from System.cpp:49:

/Users/johnsy/Pegasus/pegasus-2.2.1/src/Pegasus/Common/TraceFileHandler.h:60: '

Boolean' is used as a type, but is not defined as a type.

/Users/johnsy/Pegasus/pegasus-2.2.1/src/Pegasus/Common/TraceFileHandler.h:78: parse

error before `char'

/Users/johnsy/Pegasus/pegasus-2.2.1/src/Pegasus/Common/TraceFileHandler.h:85: parse

error before `char'

In file included from SystemUnix.cpp:67,

from System.cpp:49:

/Users/johnsy/Pegasus/pegasus-2.2.1/src/Pegasus/Common/Tracer.h:60: warning: ISO

C++ forbids declaration of `Uint32' with no type

/Users/johnsy/Pegasus/pegasus-2.2.1/src/Pegasus/Common/Tracer.h:60: warning: local

class `class encrypt(char*, int)::Tracer' shall not have static data member 

`const int encrypt(char*, int)::Tracer::Uint32'

/Users/johnsy/Pegasus/pegasus-2.2.1/src/Pegasus/Common/Tracer.h:60: parse error 

before `;' token

/Users/johnsy/Pegasus/pegasus-2.2.1/src/Pegasus/Common/Tracer.h:61: warning: ISO

C++ forbids declaration of `Uint32' with no type

/Users/johnsy/Pegasus/pegasus-2.2.1/src/Pegasus/Common/Tracer.h:61: warning: local

class `class encrypt(char*, int)::Tracer' shall not have static data member 

`const int encrypt(char*, int)::Tracer::Uint32'

/Users/johnsy/Pegasus/pegasus-2.2.1/src/Pegasus/Common/Tracer.h:61: parse error 

before `;' token

/Users/johnsy/Pegasus/pegasus-2.2.1/src/Pegasus/Common/Tracer.h:62: warning: ISO

C++ forbids declaration of `Uint32' with no type

/Users/johnsy/Pegasus/pegasus-2.2.1/src/Pegasus/Common/Tracer.h:62: warning: local

class `class encrypt(char*, int)::Tracer' shall not have static data member 

`const int encrypt(char*, int)::Tracer::Uint32'

/Users/johnsy/Pegasus/pegasus-2.2.1/src/Pegasus/Common/Tracer.h:62: parse error 

before `;' token

/Users/johnsy/Pegasus/pegasus-2.2.1/src/Pegasus/Common/Tracer.h:63: warning: ISO

C++ forbids declaration of `Uint32' with no type

/Users/johnsy/Pegasus/pegasus-2.2.1/src/Pegasus/Common/Tracer.h:63: warning: local

class `class encrypt(char*, int)::Tracer' shall not have static data member 

`const int encrypt(char*, int)::Tracer::Uint32'

/Users/johnsy/Pegasus/pegasus-2.2.1/src/Pegasus/Common/Tracer.h:63: parse error 

before `;' token

/Users/johnsy/Pegasus/pegasus-2.2.1/src/Pegasus/Common/Tracer.h:154: parse 

error before `,' token

/Users/johnsy/Pegasus/pegasus-2.2.1/src/Pegasus/Common/Tracer.h:174: parse 

error before `,' token

/Users/johnsy/Pegasus/pegasus-2.2.1/src/Pegasus/Common/Tracer.h:179: `static 

void encrypt(char*, int)::Tracer::traceBuffer(...)' has already been 

declared in `encrypt(char*, int)::Tracer'

/Users/johnsy/Pegasus/pegasus-2.2.1/src/Pegasus/Common/Tracer.h:192: parse 

error before `,' token

/Users/johnsy/Pegasus/pegasus-2.2.1/src/Pegasus/Common/Tracer.h:215: parse 

error before `,' token

/Users/johnsy/Pegasus/pegasus-2.2.1/src/Pegasus/Common/Tracer.h:220: `static 

void encrypt(char*, int)::Tracer::trace(...)' has already been declared in `

encrypt(char*, int)::Tracer'

/Users/johnsy/Pegasus/pegasus-2.2.1/src/Pegasus/Common/Tracer.h:238: parse 

error before `,' token

/Users/johnsy/Pegasus/pegasus-2.2.1/src/Pegasus/Common/Tracer.h:242: `static 

void encrypt(char*, int)::Tracer::trace(...)' has already been declared in `

encrypt(char*, int)::Tracer'

/Users/johnsy/Pegasus/pegasus-2.2.1/src/Pegasus/Common/Tracer.h:255: parse 

error before `,' token

/Users/johnsy/Pegasus/pegasus-2.2.1/src/Pegasus/Common/Tracer.h:268: warning: ISO

C++ forbids declaration of `Uint32' with no type

/Users/johnsy/Pegasus/pegasus-2.2.1/src/Pegasus/Common/Tracer.h:268: warning: local

class `class encrypt(char*, int)::Tracer' shall not have static data member 

`int encrypt(char*, int)::Tracer::Uint32'

/Users/johnsy/Pegasus/pegasus-2.2.1/src/Pegasus/Common/Tracer.h:268: conflicting

types for `int encrypt(char*, int)::Tracer::Uint32'

/Users/johnsy/Pegasus/pegasus-2.2.1/src/Pegasus/Common/Tracer.h:63: previous 

declaration as `const int encrypt(char*, int)::Tracer::Uint32'

/Users/johnsy/Pegasus/pegasus-2.2.1/src/Pegasus/Common/Tracer.h:268: parse 

error before `(' token

/Users/johnsy/Pegasus/pegasus-2.2.1/src/Pegasus/Common/Tracer.h:275: warning: ISO

C++ forbids declaration of `Uint32' with no type

/Users/johnsy/Pegasus/pegasus-2.2.1/src/Pegasus/Common/Tracer.h:275: warning: local

class `class encrypt(char*, int)::Tracer' shall not have static data member 

`int encrypt(char*, int)::Tracer::Uint32'

/Users/johnsy/Pegasus/pegasus-2.2.1/src/Pegasus/Common/Tracer.h:275: parse 

error before `(' token

/Users/johnsy/Pegasus/pegasus-2.2.1/src/Pegasus/Common/Tracer.h:282: parse 

error before `)' token

/Users/johnsy/Pegasus/pegasus-2.2.1/src/Pegasus/Common/Tracer.h:296: parse 

error before `,' token

/Users/johnsy/Pegasus/pegasus-2.2.1/src/Pegasus/Common/Tracer.h:312: parse 

error before `,' token

/Users/johnsy/Pegasus/pegasus-2.2.1/src/Pegasus/Common/Tracer.h:325: warning: ISO

C++ forbids declaration of `Boolean' with no type

/Users/johnsy/Pegasus/pegasus-2.2.1/src/Pegasus/Common/Tracer.h:325: warning: local

class `class encrypt(char*, int)::Tracer' shall not have static data member 

`int encrypt(char*, int)::Tracer::Boolean'

/Users/johnsy/Pegasus/pegasus-2.2.1/src/Pegasus/Common/Tracer.h:325: parse 

error before `(' token

/Users/johnsy/Pegasus/pegasus-2.2.1/src/Pegasus/Common/Tracer.h:332: warning: ISO

C++ forbids declaration of `Boolean' with no type

/Users/johnsy/Pegasus/pegasus-2.2.1/src/Pegasus/Common/Tracer.h:332: warning: local

class `class encrypt(char*, int)::Tracer' shall not have static data member 

`int encrypt(char*, int)::Tracer::Boolean'

/Users/johnsy/Pegasus/pegasus-2.2.1/src/Pegasus/Common/Tracer.h:332: parse 

error before `(' token

/Users/johnsy/Pegasus/pegasus-2.2.1/src/Pegasus/Common/Tracer.h:340: warning: ISO

C++ forbids declaration of `Boolean' with no type

/Users/johnsy/Pegasus/pegasus-2.2.1/src/Pegasus/Common/Tracer.h:340: warning: local

class `class encrypt(char*, int)::Tracer' shall not have static data member 

`int encrypt(char*, int)::Tracer::Boolean'

/Users/johnsy/Pegasus/pegasus-2.2.1/src/Pegasus/Common/Tracer.h:340: parse 

error before `(' token

/Users/johnsy/Pegasus/pegasus-2.2.1/src/Pegasus/Common/Tracer.h:346: warning: local

class `class encrypt(char*, int)::Tracer' shall not have static data member 

`const char encrypt(char*, int)::Tracer::_COMPONENT_SEPARATOR'

/Users/johnsy/Pegasus/pegasus-2.2.1/src/Pegasus/Common/Tracer.h:347: warning: ISO

C++ forbids declaration of `Uint32' with no type

/Users/johnsy/Pegasus/pegasus-2.2.1/src/Pegasus/Common/Tracer.h:347: warning: local

class `class encrypt(char*, int)::Tracer' shall not have static data member 

`const int encrypt(char*, int)::Tracer::Uint32'

/Users/johnsy/Pegasus/pegasus-2.2.1/src/Pegasus/Common/Tracer.h:347: conflicting

types for `const int encrypt(char*, int)::Tracer::Uint32'

/Users/johnsy/Pegasus/pegasus-2.2.1/src/Pegasus/Common/Tracer.h:275: previous 

declaration as `int encrypt(char*, int)::Tracer::Uint32'

/Users/johnsy/Pegasus/pegasus-2.2.1/src/Pegasus/Common/Tracer.h:347: parse 

error before `;' token

/Users/johnsy/Pegasus/pegasus-2.2.1/src/Pegasus/Common/Tracer.h:348: warning: ISO

C++ forbids declaration of `Uint32' with no type

/Users/johnsy/Pegasus/pegasus-2.2.1/src/Pegasus/Common/Tracer.h:348: warning: local

class `class encrypt(char*, int)::Tracer' shall not have static data member 

`const int encrypt(char*, int)::Tracer::Uint32'

/Users/johnsy/Pegasus/pegasus-2.2.1/src/Pegasus/Common/Tracer.h:348: parse 

error before `;' token

/Users/johnsy/Pegasus/pegasus-2.2.1/src/Pegasus/Common/Tracer.h:349: warning: ISO

C++ forbids declaration of `Uint32' with no type

/Users/johnsy/Pegasus/pegasus-2.2.1/src/Pegasus/Common/Tracer.h:349: warning: local

class `class encrypt(char*, int)::Tracer' shall not have static data member 

`const int encrypt(char*, int)::Tracer::Uint32'

/Users/johnsy/Pegasus/pegasus-2.2.1/src/Pegasus/Common/Tracer.h:349: parse 

error before `;' token

/Users/johnsy/Pegasus/pegasus-2.2.1/src/Pegasus/Common/Tracer.h:350: warning: ISO

C++ forbids declaration of `Boolean' with no type

/Users/johnsy/Pegasus/pegasus-2.2.1/src/Pegasus/Common/Tracer.h:350: warning: local

class `class encrypt(char*, int)::Tracer' shall not have static data member 

`const int encrypt(char*, int)::Tracer::Boolean'

/Users/johnsy/Pegasus/pegasus-2.2.1/src/Pegasus/Common/Tracer.h:350: conflicting

types for `const int encrypt(char*, int)::Tracer::Boolean'

/Users/johnsy/Pegasus/pegasus-2.2.1/src/Pegasus/Common/Tracer.h:340: previous 

declaration as `int encrypt(char*, int)::Tracer::Boolean'

/Users/johnsy/Pegasus/pegasus-2.2.1/src/Pegasus/Common/Tracer.h:350: parse 

error before `;' token

/Users/johnsy/Pegasus/pegasus-2.2.1/src/Pegasus/Common/Tracer.h:351: warning: ISO

C++ forbids declaration of `Boolean' with no type

/Users/johnsy/Pegasus/pegasus-2.2.1/src/Pegasus/Common/Tracer.h:351: warning: local

class `class encrypt(char*, int)::Tracer' shall not have static data member 

`const int encrypt(char*, int)::Tracer::Boolean'

/Users/johnsy/Pegasus/pegasus-2.2.1/src/Pegasus/Common/Tracer.h:351: parse 

error before `;' token

/Users/johnsy/Pegasus/pegasus-2.2.1/src/Pegasus/Common/Tracer.h:352: syntax 

error before `*' token

/Users/johnsy/Pegasus/pegasus-2.2.1/src/Pegasus/Common/Tracer.h:353: 'Uint32' 

is used as a type, but is not defined as a type.

/Users/johnsy/Pegasus/pegasus-2.2.1/src/Pegasus/Common/Tracer.h:354: syntax 

error before `*' token

/Users/johnsy/Pegasus/pegasus-2.2.1/src/Pegasus/Common/Tracer.h:355: warning: local

class `class encrypt(char*, int)::Tracer' shall not have static data member 

`encrypt(char*, int)::Tracer*encrypt(char*, int)::Tracer::_tracerInstance'

/Users/johnsy/Pegasus/pegasus-2.2.1/src/Pegasus/Common/Tracer.h:358: warning: local

class `class encrypt(char*, int)::Tracer' shall not have static data member 

`const char encrypt(char*, int)::Tracer::_METHOD_ENTER_MSG[]'

/Users/johnsy/Pegasus/pegasus-2.2.1/src/Pegasus/Common/Tracer.h:359: warning: local

class `class encrypt(char*, int)::Tracer' shall not have static data member 

`const char encrypt(char*, int)::Tracer::_METHOD_EXIT_MSG[]'

/Users/johnsy/Pegasus/pegasus-2.2.1/src/Pegasus/Common/Tracer.h:362: warning: local

class `class encrypt(char*, int)::Tracer' shall not have static data member 

`const char encrypt(char*, int)::Tracer::_LOG_MSG[]'

/Users/johnsy/Pegasus/pegasus-2.2.1/src/Pegasus/Common/Tracer.h:369: warning: ISO

C++ forbids declaration of `Boolean' with no type

/Users/johnsy/Pegasus/pegasus-2.2.1/src/Pegasus/Common/Tracer.h:369: warning: local

class `class encrypt(char*, int)::Tracer' shall not have static data member 

`int encrypt(char*, int)::Tracer::Boolean'

/Users/johnsy/Pegasus/pegasus-2.2.1/src/Pegasus/Common/Tracer.h:369: conflicting

types for `int encrypt(char*, int)::Tracer::Boolean'

/Users/johnsy/Pegasus/pegasus-2.2.1/src/Pegasus/Common/Tracer.h:351: previous 

declaration as `const int encrypt(char*, int)::Tracer::Boolean'

/Users/johnsy/Pegasus/pegasus-2.2.1/src/Pegasus/Common/Tracer.h:369: parse 

error before `(' token

/Users/johnsy/Pegasus/pegasus-2.2.1/src/Pegasus/Common/Tracer.h:379: parse 

error before `,' token

/Users/johnsy/Pegasus/pegasus-2.2.1/src/Pegasus/Common/Tracer.h:393: parse 

error before `,' token

/Users/johnsy/Pegasus/pegasus-2.2.1/src/Pegasus/Common/Tracer.h:397: `static 

void encrypt(char*, int)::Tracer::_trace(...)' has already been declared in 

`encrypt(char*, int)::Tracer'

/Users/johnsy/Pegasus/pegasus-2.2.1/src/Pegasus/Common/Tracer.h:405: parse 

error before `,' token

/Users/johnsy/Pegasus/pegasus-2.2.1/src/Pegasus/Common/Tracer.h:421: parse 

error before `,' token

/Users/johnsy/Pegasus/pegasus-2.2.1/src/Pegasus/Common/Tracer.h:425: `static 

void encrypt(char*, int)::Tracer::_traceBuffer(...)' has already been 

declared in `encrypt(char*, int)::Tracer'

/Users/johnsy/Pegasus/pegasus-2.2.1/src/Pegasus/Common/Tracer.h:433: parse 

error before `,' token

/Users/johnsy/Pegasus/pegasus-2.2.1/src/Pegasus/Common/Tracer.h:447: parse 

error before `,' token

/Users/johnsy/Pegasus/pegasus-2.2.1/src/Pegasus/Common/Tracer.h:450: `static 

void encrypt(char*, int)::Tracer::_traceString(...)' has already been 

declared in `encrypt(char*, int)::Tracer'

/Users/johnsy/Pegasus/pegasus-2.2.1/src/Pegasus/Common/Tracer.h:460: parse 

error before `,' token

/Users/johnsy/Pegasus/pegasus-2.2.1/src/Pegasus/Common/Tracer.h:472: parse 

error before `,' token

/Users/johnsy/Pegasus/pegasus-2.2.1/src/Pegasus/Common/Tracer.h:475: `static 

void encrypt(char*, int)::Tracer::_trace(...)' has already been declared in 

`encrypt(char*, int)::Tracer'

/Users/johnsy/Pegasus/pegasus-2.2.1/src/Pegasus/Common/Tracer.h:485: parse 

error before `,' token

/Users/johnsy/Pegasus/pegasus-2.2.1/src/Pegasus/Common/Tracer.h:497: parse 

error before `,' token

/Users/johnsy/Pegasus/pegasus-2.2.1/src/Pegasus/Common/Tracer.h:61: duplicate 

member `encrypt(char*, int)::Tracer::Uint32'

/Users/johnsy/Pegasus/pegasus-2.2.1/src/Pegasus/Common/Tracer.h:62: duplicate 

member `encrypt(char*, int)::Tracer::Uint32'

/Users/johnsy/Pegasus/pegasus-2.2.1/src/Pegasus/Common/Tracer.h:63: duplicate 

member `encrypt(char*, int)::Tracer::Uint32'

/Users/johnsy/Pegasus/pegasus-2.2.1/src/Pegasus/Common/Tracer.h:268: duplicate 

member `encrypt(char*, int)::Tracer::Uint32'

/Users/johnsy/Pegasus/pegasus-2.2.1/src/Pegasus/Common/Tracer.h:275: duplicate 

member `encrypt(char*, int)::Tracer::Uint32'

/Users/johnsy/Pegasus/pegasus-2.2.1/src/Pegasus/Common/Tracer.h:347: duplicate 

member `encrypt(char*, int)::Tracer::Uint32'

/Users/johnsy/Pegasus/pegasus-2.2.1/src/Pegasus/Common/Tracer.h:348: duplicate 

member `encrypt(char*, int)::Tracer::Uint32'

/Users/johnsy/Pegasus/pegasus-2.2.1/src/Pegasus/Common/Tracer.h:349: duplicate 

member `encrypt(char*, int)::Tracer::Uint32'

/Users/johnsy/Pegasus/pegasus-2.2.1/src/Pegasus/Common/Tracer.h:268: duplicate 

member `encrypt(char*, int)::Tracer::Uint32'

/Users/johnsy/Pegasus/pegasus-2.2.1/src/Pegasus/Common/Tracer.h:348: duplicate 

member `encrypt(char*, int)::Tracer::Uint32'

/Users/johnsy/Pegasus/pegasus-2.2.1/src/Pegasus/Common/Tracer.h:332: duplicate 

member `encrypt(char*, int)::Tracer::Boolean'

/Users/johnsy/Pegasus/pegasus-2.2.1/src/Pegasus/Common/Tracer.h:340: duplicate 

member `encrypt(char*, int)::Tracer::Boolean'

/Users/johnsy/Pegasus/pegasus-2.2.1/src/Pegasus/Common/Tracer.h:350: duplicate 

member `encrypt(char*, int)::Tracer::Boolean'

/Users/johnsy/Pegasus/pegasus-2.2.1/src/Pegasus/Common/Tracer.h:351: duplicate 

member `encrypt(char*, int)::Tracer::Boolean'

/Users/johnsy/Pegasus/pegasus-2.2.1/src/Pegasus/Common/Tracer.h:369: duplicate 

member `encrypt(char*, int)::Tracer::Boolean'

/Users/johnsy/Pegasus/pegasus-2.2.1/src/Pegasus/Common/Tracer.h:351: duplicate 

member `encrypt(char*, int)::Tracer::Boolean'

/Users/johnsy/Pegasus/pegasus-2.2.1/src/Pegasus/Common/Tracer.h:349: field `

encrypt(char*, int)::Tracer::Uint32' in local class cannot be static

/Users/johnsy/Pegasus/pegasus-2.2.1/src/Pegasus/Common/Tracer.h:62: field `

encrypt(char*, int)::Tracer::Uint32' in local class cannot be static

/Users/johnsy/Pegasus/pegasus-2.2.1/src/Pegasus/Common/Tracer.h:369: field `

encrypt(char*, int)::Tracer::Boolean' in local class cannot be static

/Users/johnsy/Pegasus/pegasus-2.2.1/src/Pegasus/Common/Tracer.h:340: field `

encrypt(char*, int)::Tracer::Boolean' in local class cannot be static

/Users/johnsy/Pegasus/pegasus-2.2.1/src/Pegasus/Common/Tracer.h:346: field `

encrypt(char*, int)::Tracer::_COMPONENT_SEPARATOR' in local class cannot be 

static

/Users/johnsy/Pegasus/pegasus-2.2.1/src/Pegasus/Common/Tracer.h:355: field `

encrypt(char*, int)::Tracer::_tracerInstance' in local class cannot be 

static

/Users/johnsy/Pegasus/pegasus-2.2.1/src/Pegasus/Common/Tracer.h:358: field `

encrypt(char*, int)::Tracer::_METHOD_ENTER_MSG' in local class cannot be 

static

/Users/johnsy/Pegasus/pegasus-2.2.1/src/Pegasus/Common/Tracer.h:359: field `

encrypt(char*, int)::Tracer::_METHOD_EXIT_MSG' in local class cannot be 

static

/Users/johnsy/Pegasus/pegasus-2.2.1/src/Pegasus/Common/Tracer.h:362: field `

encrypt(char*, int)::Tracer::_LOG_MSG' in local class cannot be static

/Users/johnsy/Pegasus/pegasus-2.2.1/src/Pegasus/Common/Tracer.h: In static 

member function `static void encrypt(char*, int)::Tracer::traceBuffer(...)':

/Users/johnsy/Pegasus/pegasus-2.2.1/src/Pegasus/Common/Tracer.h:159: `

traceComponent' undeclared (first use this function)

/Users/johnsy/Pegasus/pegasus-2.2.1/src/Pegasus/Common/Tracer.h:159: `

traceLevel' undeclared (first use this function)

/Users/johnsy/Pegasus/pegasus-2.2.1/src/Pegasus/Common/Tracer.h:159: `data' 

undeclared (first use this function)

/Users/johnsy/Pegasus/pegasus-2.2.1/src/Pegasus/Common/Tracer.h:159: `size' 

undeclared (first use this function)

/Users/johnsy/Pegasus/pegasus-2.2.1/src/Pegasus/Common/Tracer.h: In static 

member function `static void encrypt(char*, int)::Tracer::traceBuffer(...)':

/Users/johnsy/Pegasus/pegasus-2.2.1/src/Pegasus/Common/Tracer.h:180: `fileName' 

undeclared (first use this function)

/Users/johnsy/Pegasus/pegasus-2.2.1/src/Pegasus/Common/Tracer.h:180: `lineNum' 

undeclared (first use this function)

/Users/johnsy/Pegasus/pegasus-2.2.1/src/Pegasus/Common/Tracer.h:181: `

traceComponent' undeclared (first use this function)

/Users/johnsy/Pegasus/pegasus-2.2.1/src/Pegasus/Common/Tracer.h:181: `

traceLevel' undeclared (first use this function)

/Users/johnsy/Pegasus/pegasus-2.2.1/src/Pegasus/Common/Tracer.h:181: `data' 

undeclared (first use this function)

/Users/johnsy/Pegasus/pegasus-2.2.1/src/Pegasus/Common/Tracer.h:181: `size' 

undeclared (first use this function)

/Users/johnsy/Pegasus/pegasus-2.2.1/src/Pegasus/Common/Tracer.h: In static 

member function `static void encrypt(char*, int)::Tracer::trace(...)':

/Users/johnsy/Pegasus/pegasus-2.2.1/src/Pegasus/Common/Tracer.h:199: `fmt' 

undeclared (first use this function)

/Users/johnsy/Pegasus/pegasus-2.2.1/src/Pegasus/Common/Tracer.h:200: `

traceComponent' undeclared (first use this function)

/Users/johnsy/Pegasus/pegasus-2.2.1/src/Pegasus/Common/Tracer.h:200: `

traceLevel' undeclared (first use this function)

/Users/johnsy/Pegasus/pegasus-2.2.1/src/Pegasus/Common/Tracer.h: In static 

member function `static void encrypt(char*, int)::Tracer::trace(...)':

/Users/johnsy/Pegasus/pegasus-2.2.1/src/Pegasus/Common/Tracer.h:223: `fmt' 

undeclared (first use this function)

/Users/johnsy/Pegasus/pegasus-2.2.1/src/Pegasus/Common/Tracer.h:224: `fileName' 

undeclared (first use this function)

/Users/johnsy/Pegasus/pegasus-2.2.1/src/Pegasus/Common/Tracer.h:224: `lineNum' 

undeclared (first use this function)

/Users/johnsy/Pegasus/pegasus-2.2.1/src/Pegasus/Common/Tracer.h:224: `

traceComponent' undeclared (first use this function)

/Users/johnsy/Pegasus/pegasus-2.2.1/src/Pegasus/Common/Tracer.h:224: `

traceLevel' undeclared (first use this function)

/Users/johnsy/Pegasus/pegasus-2.2.1/src/Pegasus/Common/Tracer.h: In static 

member function `static void encrypt(char*, int)::Tracer::trace(...)':

/Users/johnsy/Pegasus/pegasus-2.2.1/src/Pegasus/Common/Tracer.h:243: `fileName' 

undeclared (first use this function)

/Users/johnsy/Pegasus/pegasus-2.2.1/src/Pegasus/Common/Tracer.h:243: `lineNum' 

undeclared (first use this function)

/Users/johnsy/Pegasus/pegasus-2.2.1/src/Pegasus/Common/Tracer.h:243: `

traceComponent' undeclared (first use this function)

/Users/johnsy/Pegasus/pegasus-2.2.1/src/Pegasus/Common/Tracer.h:243: `

traceLevel' undeclared (first use this function)

/Users/johnsy/Pegasus/pegasus-2.2.1/src/Pegasus/Common/Tracer.h:244: `

traceString' undeclared (first use this function)

/Users/johnsy/Pegasus/pegasus-2.2.1/src/Pegasus/Common/Tracer.h: In static 

member function `static void encrypt(char*, 

int)::Tracer::traceCIMException(...)':

/Users/johnsy/Pegasus/pegasus-2.2.1/src/Pegasus/Common/Tracer.h:259: `

traceComponent' undeclared (first use this function)

/Users/johnsy/Pegasus/pegasus-2.2.1/src/Pegasus/Common/Tracer.h:259: `

traceLevel' undeclared (first use this function)

/Users/johnsy/Pegasus/pegasus-2.2.1/src/Pegasus/Common/Tracer.h:259: `

cimException' undeclared (first use this function)

/Users/johnsy/Pegasus/pegasus-2.2.1/src/Pegasus/Common/Tracer.h: In static 

member function `static void encrypt(char*, int)::Tracer::traceEnter(...)':

/Users/johnsy/Pegasus/pegasus-2.2.1/src/Pegasus/Common/Tracer.h:300: `fileName' 

undeclared (first use this function)

/Users/johnsy/Pegasus/pegasus-2.2.1/src/Pegasus/Common/Tracer.h:300: `lineNum' 

undeclared (first use this function)

/Users/johnsy/Pegasus/pegasus-2.2.1/src/Pegasus/Common/Tracer.h:300: `

traceComponent' undeclared (first use this function)

/Users/johnsy/Pegasus/pegasus-2.2.1/src/Pegasus/Common/Tracer.h:301: `

methodName' undeclared (first use this function)

/Users/johnsy/Pegasus/pegasus-2.2.1/src/Pegasus/Common/Tracer.h: In static 

member function `static void encrypt(char*, int)::Tracer::traceExit(...)':

/Users/johnsy/Pegasus/pegasus-2.2.1/src/Pegasus/Common/Tracer.h:316: `fileName' 

undeclared (first use this function)

/Users/johnsy/Pegasus/pegasus-2.2.1/src/Pegasus/Common/Tracer.h:316: `lineNum' 

undeclared (first use this function)

/Users/johnsy/Pegasus/pegasus-2.2.1/src/Pegasus/Common/Tracer.h:316: `

traceComponent' undeclared (first use this function)

/Users/johnsy/Pegasus/pegasus-2.2.1/src/Pegasus/Common/Tracer.h:317: `

methodName' undeclared (first use this function)

In file included from System.cpp:49:

SystemUnix.cpp: In function `void encrypt(char*, int)':

SystemUnix.cpp:77: `Uint32' undeclared (first use this function)

SystemUnix.cpp:77: parse error before `)' token

SystemUnix.cpp: In function `void Pegasus::sleep_wrapper(...)':

SystemUnix.cpp:79: `seconds' undeclared (first use this function)

SystemUnix.cpp:82: `milliseconds' undeclared (first use this function)

SystemUnix.cpp:83: `void Pegasus::System::getCurrentTime' is not a static 

member of `class Pegasus::System'

SystemUnix.cpp:83: variable `void Pegasus::System::getCurrentTime' has 

initializer but incomplete type

SystemUnix.cpp:83: syntax error before `{' token

SystemUnix.cpp:85: `tv' undeclared (first use this function)

SystemUnix.cpp:85: warning: ISO C++ forbids declaration of `gettimeofday' with 

no type

SystemUnix.cpp:85: warning: initializer list being treated as compound 

expression

SystemUnix.cpp:86: warning: ISO C++ forbids declaration of `seconds' with no 

type

SystemUnix.cpp:86: `int Pegasus::seconds' used prior to declaration

SystemUnix.cpp:87: warning: ISO C++ forbids declaration of `milliseconds' with 

no type

SystemUnix.cpp:87: `int Pegasus::milliseconds' used prior to declaration

SystemUnix.cpp: At global scope:

SystemUnix.cpp:101: parse error before `)' token

SystemUnix.cpp:102: prototype for `void Pegasus::System::sleep(...)' does not 

match any in class `Pegasus::System'

System.h:91: candidate is: static void Pegasus::System::sleep(unsigned int)

SystemUnix.cpp:121: type specifier omitted for parameter `Uint32'

SystemUnix.cpp:121: parse error before `)' token

SystemUnix.cpp:122: prototype for `Boolean 

Pegasus::System::getCurrentDirectory(...)' does not match any in class `

Pegasus::System'

System.h:99: candidate is: static Boolean 

Pegasus::System::getCurrentDirectory(char*, unsigned int)

SystemUnix.cpp: In member function `Boolean 

Pegasus::System::getCurrentDirectory(...)':

SystemUnix.cpp:123: `path' undeclared (first use this function)

SystemUnix.cpp: At global scope:

SystemUnix.cpp:146: type specifier omitted for parameter `Uint32'

SystemUnix.cpp:146: parse error before `&' token

SystemUnix.cpp:147: prototype for `Boolean Pegasus::System::getFileSize(...)' 

does not match any in class `Pegasus::System'

System.h:107: candidate is: static Boolean Pegasus::System::getFileSize(const 

char*, Uint32&)

SystemUnix.cpp: In static member function `static 

Pegasus::DynamicLibraryHandle_* Pegasus::System::loadDynamicLibrary(const 

char*)':

SystemUnix.cpp:177: warning: ISO C++ forbids declaration of `Uint32' with no 

type

SystemUnix.cpp:177: uninitialized const `Uint32'

SystemUnix.cpp:177: parse error before `=' token

SystemUnix.cpp:177: `PEG_TRACE_COMPONENT' undeclared (first use this function)

SystemUnix.cpp:179: `LEVEL2' is not a member of type `encrypt(char*, 

int)::Tracer'

SystemUnix.cpp: At global scope:

SystemUnix.cpp:338: syntax error before `::' token

SystemUnix.cpp:344: warning: non-local variable `encrypt(char*, 

int)::servent*serv' uses local type `encrypt(char*, int)::servent'

SystemUnix.cpp:350: parse error before `if'

SystemUnix.cpp: In static member function `static Pegasus::String 

Pegasus::System::getPrivilegedUserName()':

SystemUnix.cpp:471: invalid use of undefined type `class encrypt(char*, 

int)::AssertionFailureException'

/Users/johnsy/Pegasus/pegasus-2.2.1/src/Pegasus/Common/InternalException.h:44: forward

declaration of `class encrypt(char*, int)::AssertionFailureException'

SystemUnix.cpp: At global scope:

SystemUnix.cpp:478: syntax error before `::' token

SystemUnix.cpp:533: `Uint32' was not declared in this scope

SystemUnix.cpp:533: parse error before `,' token

SystemUnix.cpp:534: prototype for `void Pegasus::System::syslog(...)' does not 

match any in class `Pegasus::System'

System.h:236: candidate is: static void Pegasus::System::syslog(unsigned int, 

const char*)

SystemUnix.cpp:610: parse error before `}' token

System.cpp:58: confused by earlier errors, bailing out

make[3]: *** [/Users/johnsy/Pegasus/pegasus-2.2.1/obj/Pegasus/Common/System.o] Error 1

make[2]: *** [all] Error 2

make[1]: *** [all] Error 2

make: *** [all] Error 2



Please do send suggestions 

 

Thanks & Best Regards,

 Asif
(Software Engineer)
 
S P Software Technologies (I) Pvt. Ltd.
(An ISO 9001:2000 Company)
Pune, Maharashtra, India - 411 004.
 
Tel : 91-20-4006154, 4006983, 4007503.
Fax : 91-20-4006153.
 
Email : sayyadasif at hotmail.com , sayyed.asif at spsoftindia.com
Visit us at : www.spsoftindia.com







-------------- next part --------------
An HTML attachment was scrubbed...
URL: <http://www.riscos.info/pipermail/gcc/attachments/20031008/507a3bf5/attachment.html>


More information about the gcc mailing list