[gccsdk] [Bug 209] New: Error building native compiler

bugzilla-daemon at riscos.info bugzilla-daemon at riscos.info
Sun Sep 12 00:58:09 PDT 2010


           Summary: Error building native compiler
           Product: GCC/GCCSDK
           Version: other
          Platform: Other
        OS/Version: Linux
            Status: NEW
          Severity: normal
          Priority: P1
         Component: GCCSDK Build
        AssignedTo: John.Tytgat at aaug.net
        ReportedBy: chrisg at care4free.net
   Estimated Hours: 0.0

I run the command on Ubuntu 9.10,

make ronative 2>&1 | tee build-output-ronative.txt

Gets to building cmunge and fails with the following error,

make[2]: Entering directory `/linux1/gccsdk/gcc4/builddir/ronative/cmunge'
cd /linux1/gccsdk/gcc4/riscos/cmunge && /bin/sh
/linux1/gccsdk/gcc4/riscos/cmunge/missing --run aclocal-1.9 
 cd /linux1/gccsdk/gcc4/riscos/cmunge && /bin/sh
/linux1/gccsdk/gcc4/riscos/cmunge/missing --run automake-1.9 --foreign 
Makefile.am:3: shell svnversion -n ${srcdir} /trunk/gcc4/riscos/cmunge:
non-POSIX variable name
Makefile.am:3: (probably a GNU make extension)
make[2]: *** [/linux1/gccsdk/gcc4/riscos/cmunge/Makefile.in] Error 1
make[2]: Leaving directory `/linux1/gccsdk/gcc4/builddir/ronative/cmunge'
make[1]: *** [buildstepsdir/ronative-riscostools] Error 2
make[1]: Leaving directory `/linux1/gccsdk/gcc4'
make: *** [getenv] Error 2

Configure bugmail: http://www.riscos.info/bugzilla3/userprefs.cgi?tab=email
------- You are receiving this mail because: -------
You are watching all bug changes.

More information about the gcc mailing list