[gccsdk] Error Using Autobuilder

Robert Heaton rob at robheaton.co.uk
Mon Apr 23 11:23:12 PDT 2012

On 22 April 2012 20:57, Chris Gransden <chrisg at care4free.net> wrote:

> In article
> <CAHQJq4Jvvyj8Jf-zchjyk3ZKxgzsyJMFg=5qMdS1PbjXqbdD7g at mail.gmail.com>,
>    Robert Heaton <rob at robheaton.co.uk> wrote:
> > Hello,
> > I checked out the GCCSDK autobuilder earlier today, I have been using the
> > guide here;
> > http://www.riscos.info/index.php/Using_GCCSDK
> > When I try to build the example package 'wget' I get the following error;
> > checking whether to use NLS... no
> > configure: error: p11-kit cannot be used as a static library
> > Autobuilder: Running make command:
> > /home/robheaton/Downloads/gccsdk/env/ro-make
> > Autobuilder: No known build method
> > Package libp11-kit0: ***Failure***
> > Dependency "libp11-kit0" failed for libgnutls26
> > Dependency "libgnutls26" failed for wget
> > Build for package "wget" failed
> I've checked in a fix for this. r5748.

I'm getting closer, but I've hit another problem;

link.c:149:4: error: #error "This platform lacks a link function, and
Gnulib doesn't provide a replacement. This is a bug in Gnulib."
make[4]: *** [link.o] Error 1
make[4]: Leaving directory
make[3]: *** [all-recursive] Error 1
make[3]: Leaving directory
make[2]: *** [all] Error 2
make[2]: Leaving directory
make[1]: *** [all-recursive] Error 1
make[1]: Leaving directory
make: *** [all] Error 2
Package tar: ***Failure***
Dependency "tar" failed for dpkg
Dependency "dpkg" failed for wget
Build for package "wget" failed

Any help would be greatly appreciated!
Many Thanks,
-------------- next part --------------
An HTML attachment was scrubbed...
URL: <http://www.riscos.info/pipermail/gcc/attachments/20120423/120572ef/attachment.html>

More information about the gcc mailing list