[gccsdk] Error Using Autobuilder

Robert Heaton rob at robheaton.co.uk
Mon Apr 23 12:29:38 PDT 2012


On 23 April 2012 19:48, Chris Gransden <chrisg at care4free.net> wrote:

> In article
> <CAHQJq4+4uBMvoZnUBipg8nPeD0sdToPO61eK=fPw_tYi2q0MKA at mail.gmail.com>,
>    Robert Heaton <rob at robheaton.co.uk> wrote:
>
> > I'm getting closer, but I've hit another problem;
>
> > link.c:149:4: error: #error "This platform lacks a link function, and
> > Gnulib doesn't provide a replacement. This is a bug in Gnulib."
> > make[4]: *** [link.o] Error 1
> > make[4]: Leaving directory
> > `/home/robheaton/Downloads/gccsdk/build/tar/tar-1.26/gnu'
> > make[3]: *** [all-recursive] Error 1
> > make[3]: Leaving directory
> > `/home/robheaton/Downloads/gccsdk/build/tar/tar-1.26/gnu'
> > make[2]: *** [all] Error 2
> > make[2]: Leaving directory
> > `/home/robheaton/Downloads/gccsdk/build/tar/tar-1.26/gnu'
> > make[1]: *** [all-recursive] Error 1
> > make[1]: Leaving directory
> > `/home/robheaton/Downloads/gccsdk/build/tar/tar-1.26'
> > make: *** [all] Error 2
> > Package tar: ***Failure***
> > Dependency "tar" failed for dpkg
> > Dependency "dpkg" failed for wget
> > Build for package "wget" failed
>
> This is now fixed. Try r5749


Thanks for the help Chris,

Getting closer!
The autobuilder now gets as far as building dpkg;

checking for lchown... no
configure: error: missing required function
Autobuilder: Running make command:
/home/robheaton/Downloads/gccsdk/env/ro-make
Autobuilder: No known build method
Package dpkg: ***Failure***
Dependency "dpkg" failed for wget
Build for package "wget" failed


Thanks,
Rob.
-------------- next part --------------
An HTML attachment was scrubbed...
URL: <http://www.riscos.info/pipermail/gcc/attachments/20120423/cf039ddc/attachment.html>


More information about the gcc mailing list