[Rpcemu] RPCEmu 0.9.3 Build Failure

Paul Bell linux at dpb.org.uk
Wed Jun 3 02:56:57 PDT 2020


Hello all,

I'm getting a build failure on Arch Linux with 0.9.3 for 'rpcemu-
recompiler'. 'rpcemu-interpreter' builds fine. This is with gcc
(10.1.0-2). The relevant output -

/usr/bin/ld: release/codegen_amd64.o:(.bss+0x4): multiple definition of
`blockend'; release/ArmDynarec.o:(.bss+0x40310): first defined here
/usr/bin/ld: release/codegen_amd64.o:(.bss+0x0): multiple definition of
`linecyc'; release/ArmDynarec.o:(.bss+0x0): first defined here
collect2: error: ld returned 1 exit status
make[1]: *** [Makefile.Release:477: ../../rpcemu-recompiler] Error 1
make[1]: Leaving directory '/dev/shm/makepkg-shm/rpcemu/src/rpcemu-
0.9.3/src/qt5'
make: *** [Makefile:42: release] Error 2

Any ideas please?

Thanks ... Paul




More information about the RPCEmu mailing list